Reaction Details
TargetUrotensin-2
LigandBDBM50414769
Substrate/Competitorn/a
Meas. Tech.ChEMBL_588520 (CHEMBL1041260)
EC50 645.65±n/a nM
Citation Lehmann, FCurrier, EAClemons, BHansen, LKOlsson, RHacksell, ULuthman, K Novel and potent small-molecule urotensin II receptor agonists. Bioorg Med Chem17:4657-65 (2009) 
 
Urotensin-2
Name:Urotensin-2
Type:PROTEIN
Mol. Mass.:14297.49
Organism:Homo sapiens (Human)
Description:ChEMBL_643307
Residue:124
BDBM50414769
NameBDBM50414769
Synonyms:CHEMBL573574
TypeSmall organic molecule
Emp. Form.C29H30N2O2
Mol. Mass.438.5607
SMILESCOc1ccc(cc1)-c1cccc(c1)C(=O)NC(CCN(C)C)c1ccc2ccccc2c1