Reaction Details
TargetUrotensin-2
LigandBDBM50414782
Substrate/Competitorn/a
Meas. Tech.ChEMBL_588520 (CHEMBL1041260)
EC50 77.62±n/a nM
Citation Lehmann, FCurrier, EAClemons, BHansen, LKOlsson, RHacksell, ULuthman, K Novel and potent small-molecule urotensin II receptor agonists. Bioorg Med Chem17:4657-65 (2009) 
 
Urotensin-2
Name:Urotensin-2
Type:PROTEIN
Mol. Mass.:14297.49
Organism:Homo sapiens (Human)
Description:ChEMBL_643307
Residue:124
BDBM50414782
NameBDBM50414782
Synonyms:CHEMBL583981
TypeSmall organic molecule
Emp. Form.C24H25ClN2O
Mol. Mass.392.921
SMILESCN(C)CCC(NC(=O)c1ccc(cc1)-c1ccccc1)c1ccc(Cl)cc1