Reaction Details
TargetPeroxisome proliferator-activated receptor gamma
LigandBDBM50383373
Substrate/Competitorn/a
Meas. Tech.ChEMBL_610660 (CHEMBL1071680)
IC50>10000±n/a nM
Citation Shearer, BGWiethe, RWAshe, ABillin, ANWay, JMStanley, TBWagner, CDXu, RXLeesnitzer, LMMerrihew, RVShearer, TWJeune, MRUlrich, JCWillson, TM Identification and characterization of 4-chloro-N-(2-{[5-trifluoromethyl)-2-pyridyl]sulfonyl}ethyl)benzamide (GSK3787), a selective and irreversible peroxisome proliferator-activated receptor delta (PPARdelta) antagonist. J Med Chem53:1857-61 (2010) 
 
Peroxisome proliferator-activated receptor gamma
Name:Peroxisome proliferator-activated receptor gamma
Type:Nuclear Receptor
Mol. Mass.:57613.46
Organism:Homo sapiens (Human)
Description:P37231
Residue:505
BDBM50383373
NameBDBM50383373
Synonyms:CHEMBL592652 | GSK0660
TypeSmall organic molecule
Emp. Form.C19H18N2O5S2
Mol. Mass.418.487
SMILESCOC(=O)c1sccc1S(=O)(=O)Nc1ccc(Nc2ccccc2)cc1OC