Reaction Details
Target5-hydroxytryptamine receptor 6
LigandBDBM50416115
Substrate/Competitorn/a
Meas. Tech.ChEMBL_634948 (CHEMBL1117802)
Ki 63.1±n/a nM
Citation Reid, MCarlyle, ICaulfield, WLClarkson, TRCusick, FEpemolu, OGilfillan, RGoodwin, RJaap, DO'Donnell, ECPresland, JRankovic, ZSpinks, DSpinks, GThomson, AMThomson, FStrain, JWishart, G The discovery and SAR of indoline-3-carboxamides--a new series of 5-HT6 antagonists. Bioorg Med Chem Lett20:3713-6 (2010) 
 
5-hydroxytryptamine receptor 6
Name:5-hydroxytryptamine receptor 6
Type:G Protein-Coupled Receptor (GPCR)
Mol. Mass.:46968.43
Organism:Homo sapiens (Human)
Description:P50406
Residue:440
BDBM50416115
NameBDBM50416115
Synonyms:CHEMBL1084614
TypeSmall organic molecule
Emp. Form.C31H31N3O5S
Mol. Mass.557.66
SMILESCOc1cccc(c1)N1CCN(CC1)C(=O)C1CN(c2ccccc12)S(=O)(=O)c1ccc(OC)c2ccccc12