Reaction Details
Target5-hydroxytryptamine receptor 6
LigandBDBM50416119
Substrate/Competitorn/a
Meas. Tech.ChEMBL_634948 (CHEMBL1117802)
Ki 79.43±n/a nM
Citation Reid, MCarlyle, ICaulfield, WLClarkson, TRCusick, FEpemolu, OGilfillan, RGoodwin, RJaap, DO'Donnell, ECPresland, JRankovic, ZSpinks, DSpinks, GThomson, AMThomson, FStrain, JWishart, G The discovery and SAR of indoline-3-carboxamides--a new series of 5-HT6 antagonists. Bioorg Med Chem Lett20:3713-6 (2010) 
 
5-hydroxytryptamine receptor 6
Name:5-hydroxytryptamine receptor 6
Type:G Protein-Coupled Receptor (GPCR)
Mol. Mass.:46968.43
Organism:Homo sapiens (Human)
Description:P50406
Residue:440
BDBM50416119
NameBDBM50416119
Synonyms:CHEMBL1082483
TypeSmall organic molecule
Emp. Form.C26H26N4O4S
Mol. Mass.490.574
SMILESCOc1ccc(c2ccccc12)S(=O)(=O)N1CC(C(=O)NCCCn2ccnc2)c2ccccc12