Reaction Details
TargetUrotensin-2
LigandBDBM50416341
Substrate/Competitorn/a
Meas. Tech.ChEMBL_643307 (CHEMBL1177478)
EC50 2398.83±n/a nM
Citation Lehmann, FCurrier, EAOlsson, RMa, JNBurstein, ESHacksell, ULuthman, K Optimization of isochromanone based urotensin II receptor agonists. Bioorg Med Chem18:4844-54 (2011) 
 
Urotensin-2
Name:Urotensin-2
Type:PROTEIN
Mol. Mass.:14297.49
Organism:Homo sapiens (Human)
Description:ChEMBL_643307
Residue:124
BDBM50416341
NameBDBM50416341
Synonyms:CHEMBL1173170
TypeSmall organic molecule
Emp. Form.C25H30N2O2
Mol. Mass.390.5179
SMILESCN(C)CCC1(Cc2ccccc2C(=O)O1)c1cccc(c1)N(CC=C)CC=C