Reaction Details
TargetUrotensin-2
LigandBDBM50416350
Substrate/Competitorn/a
Meas. Tech.ChEMBL_643307 (CHEMBL1177478)
EC50 51.29±n/a nM
Citation Lehmann, FCurrier, EAOlsson, RMa, JNBurstein, ESHacksell, ULuthman, K Optimization of isochromanone based urotensin II receptor agonists. Bioorg Med Chem18:4844-54 (2011) 
 
Urotensin-2
Name:Urotensin-2
Type:PROTEIN
Mol. Mass.:14297.49
Organism:Homo sapiens (Human)
Description:ChEMBL_643307
Residue:124
BDBM50416350
NameBDBM50416350
Synonyms:CHEMBL1171808
TypeSmall organic molecule
Emp. Form.C21H23Cl2NO2
Mol. Mass.392.319
SMILESCN(C)CCC1(Cc2cc(C)c(C)cc2C(=O)O1)c1ccc(Cl)c(Cl)c1