Reaction Details
TargetUrotensin-2
LigandBDBM50416356
Substrate/Competitorn/a
Meas. Tech.ChEMBL_643307 (CHEMBL1177478)
EC50 2238.72±n/a nM
Citation Lehmann, FCurrier, EAOlsson, RMa, JNBurstein, ESHacksell, ULuthman, K Optimization of isochromanone based urotensin II receptor agonists. Bioorg Med Chem18:4844-54 (2011) 
 
Urotensin-2
Name:Urotensin-2
Type:PROTEIN
Mol. Mass.:14297.49
Organism:Homo sapiens (Human)
Description:ChEMBL_643307
Residue:124
BDBM50416356
NameBDBM50416356
Synonyms:CHEMBL1172180
TypeSmall organic molecule
Emp. Form.C22H27ClN2O
Mol. Mass.370.916
SMILESCC(C)N1C(=O)c2ccccc2CC1(CCN(C)C)c1ccc(Cl)cc1