Reaction Details
TargetGlucocorticoid receptor
LigandBDBM50417887
Substrate/Competitorn/a
Meas. Tech.ChEMBL_716755 (CHEMBL1670637)
IC50 6.31±n/a nM
Citation Diallo, HAngell, DCBarnett, HABiggadike, KCoe, DMCooper, TWCraven, AGray, JRHouse, DJack, TIKeeling, SPMacdonald, SJMcLay, IMOliver, STaylor, SJUings, IJWellaway, N Discovery of a potent series of non-steroidal nona-trifluoromethyl carbinol glucocorticoid receptor agonists with reduced lipophilicity. Bioorg Med Chem Lett21:1126-33 (2011) 
 
Glucocorticoid receptor
Name:Glucocorticoid receptor
Type:Enzyme
Mol. Mass.:85656.87
Organism:Homo sapiens (Human)
Description:P04150
Residue:777
BDBM50417887
NameBDBM50417887
Synonyms:CHEMBL1668077
TypeSmall organic molecule
Emp. Form.C29H37N5O2S
Mol. Mass.519.701
SMILESCC(C)Nc1cccc(c1)-n1ncc2c(NC[C@H](C)NS(=O)(=O)c3c(C)cc(C)cc3C)cc(C)cc12