Reaction Details
TargetGlucocorticoid receptor
LigandBDBM50417895
Substrate/Competitorn/a
Meas. Tech.ChEMBL_716756 (CHEMBL1670638)
IC50 7.94±n/a nM
Citation Diallo, HAngell, DCBarnett, HABiggadike, KCoe, DMCooper, TWCraven, AGray, JRHouse, DJack, TIKeeling, SPMacdonald, SJMcLay, IMOliver, STaylor, SJUings, IJWellaway, N Discovery of a potent series of non-steroidal nona-trifluoromethyl carbinol glucocorticoid receptor agonists with reduced lipophilicity. Bioorg Med Chem Lett21:1126-33 (2011) 
 
Glucocorticoid receptor
Name:Glucocorticoid receptor
Type:Enzyme
Mol. Mass.:85656.87
Organism:Homo sapiens (Human)
Description:P04150
Residue:777
BDBM50417895
NameBDBM50417895
Synonyms:CHEMBL1668085
TypeSmall organic molecule
Emp. Form.C24H33N5O3S
Mol. Mass.471.616
SMILESCC(C)NC(=O)c1cccc(c1)-n1ncc2c(NC[C@H](C)NS(=O)(=O)C(C)C)cc(C)cc12