Reaction Details
TargetGlucocorticoid receptor
LigandBDBM50417882
Substrate/Competitorn/a
Meas. Tech.ChEMBL_716758 (CHEMBL1670640)
IC50 10±n/a nM
Citation Diallo, HAngell, DCBarnett, HABiggadike, KCoe, DMCooper, TWCraven, AGray, JRHouse, DJack, TIKeeling, SPMacdonald, SJMcLay, IMOliver, STaylor, SJUings, IJWellaway, N Discovery of a potent series of non-steroidal nona-trifluoromethyl carbinol glucocorticoid receptor agonists with reduced lipophilicity. Bioorg Med Chem Lett21:1126-33 (2011) 
 
Glucocorticoid receptor
Name:Glucocorticoid receptor
Type:Enzyme
Mol. Mass.:85656.87
Organism:Homo sapiens (Human)
Description:P04150
Residue:777
BDBM50417882
NameBDBM50417882
Synonyms:CHEMBL1668072
TypeSmall organic molecule
Emp. Form.C29H37N5O2S
Mol. Mass.519.701
SMILESCC(C)Nc1ccc(cc1)-n1ncc2c(NC[C@H](C)NS(=O)(=O)c3c(C)cc(C)cc3C)cc(C)cc12