Reaction Details
TargetSolute carrier family 15 member 1
LigandBDBM50418934
Substrate/Competitorn/a
Meas. Tech.ChEMBL_758406 (CHEMBL1811272)
Ki 245470891.57±n/a nM
Citation Thorn, KNielsen, CUJakobsen, PSteffansen, BZercher, CKBegtrup, M The tandem chain extension aldol reaction used for synthesis of ketomethylene tripeptidomimetics targeting hPEPT1. Bioorg Med Chem Lett21:4597-601 (2011) 
 
Solute carrier family 15 member 1
Name:Solute carrier family 15 member 1
Type:PROTEIN
Mol. Mass.:78818.07
Organism:Homo sapiens (Human)
Description:ChEMBL_1488839
Residue:708
BDBM50418934
NameBDBM50418934
Synonyms:CHEMBL1807357
TypeSmall organic molecule
Emp. Form.C27H34N3O6
Mol. Mass.496.5748
SMILES[NH3+][C@@H](Cc1ccccc1)C(=O)N[C@@H](COC(=O)c1ccccc1)C(=O)N[C@@H](C1CCCCC1)C(O)=O