Reaction Details
TargetSphingosine 1-phosphate receptor 1
LigandBDBM50419986
Substrate/Competitorn/a
Meas. Tech.ChEMBL_813766 (CHEMBL2020024)
EC50 3.16±n/a nM
Citation Meng, QZhao, BXu, QXu, XDeng, GLi, CLuan, LRen, FWang, HXu, HXu, YZhang, HXiang, JNElliott, JDGuo, TBZhao, YZhang, WLu, HLin, X Indole-propionic acid derivatives as potent, S1P3-sparing and EAE efficacious sphingosine-1-phosphate 1 (S1P1) receptor agonists. Bioorg Med Chem Lett22:2794-7 (2012) 
 
Sphingosine 1-phosphate receptor 1
Name:Sphingosine 1-phosphate receptor 1
Type:Enzyme
Mol. Mass.:42836.02
Organism:Homo sapiens (Human)
Description:P21453
Residue:382
BDBM50419986
NameBDBM50419986
Synonyms:CHEMBL2018309
TypeSmall organic molecule
Emp. Form.C23H23N3O5
Mol. Mass.421.4458
SMILESCCOc1ccc(cc1OCC)-c1nc(no1)-c1cccc2c(CCC(O)=O)c[nH]c12