Reaction Details
TargetSphingosine 1-phosphate receptor 3
LigandBDBM50419989
Substrate/Competitorn/a
Meas. Tech.ChEMBL_813767 (CHEMBL2020025)
EC50>10000±n/a nM
Citation Meng, QZhao, BXu, QXu, XDeng, GLi, CLuan, LRen, FWang, HXu, HXu, YZhang, HXiang, JNElliott, JDGuo, TBZhao, YZhang, WLu, HLin, X Indole-propionic acid derivatives as potent, S1P3-sparing and EAE efficacious sphingosine-1-phosphate 1 (S1P1) receptor agonists. Bioorg Med Chem Lett22:2794-7 (2012) 
 
Sphingosine 1-phosphate receptor 3
Name:Sphingosine 1-phosphate receptor 3
Type:G Protein-Coupled Receptor (GPCR)
Mol. Mass.:42278.13
Organism:Homo sapiens (Human)
Description:Q99500
Residue:378
BDBM50419989
NameBDBM50419989
Synonyms:CHEMBL2018313
TypeSmall organic molecule
Emp. Form.C19H14ClN3O3
Mol. Mass.367.786
SMILESOC(=O)CCc1c[nH]c2c(cccc12)-c1noc(n1)-c1ccc(Cl)cc1