Reaction Details
TargetMast/stem cell growth factor receptor Kit
LigandBDBM50420996
Substrate/Competitorn/a
Meas. Tech.ChEMBL_841361 (CHEMBL2089888)
IC50 11±n/a nM
Citation Kim, MHTsuhako, ALCo, EWAftab, DTBentzien, FChen, JCheng, WEngst, SGoon, LKlein, RRLe, DTMac, MParks, JJQian, FRodriquez, MStout, TJTill, JHWon, KAWu, XYakes, FMYu, PZhang, WZhao, YLamb, PNuss, JMXu, W The design, synthesis, and biological evaluation of potent receptor tyrosine kinase inhibitors. Bioorg Med Chem Lett22:4979-85 (2012) 
 
Mast/stem cell growth factor receptor Kit
Name:Mast/stem cell growth factor receptor Kit
Type:Protein
Mol. Mass.:109869.37
Organism:Homo sapiens (Human)
Description:P10721
Residue:976
BDBM50420996
NameBDBM50420996
Synonyms:CHEMBL2086760
TypeSmall organic molecule
Emp. Form.C25H26ClN5O
Mol. Mass.447.96
SMILESCCN1CCC(CC1)Nc1ccc2NC(=O)C(=C(c3ncc[nH]3)c3ccc(Cl)cc3)c2c1