Reaction Details
TargetVascular endothelial growth factor receptor 2
LigandBDBM4811
Substrate/Competitorn/a
Meas. Tech.ChEMBL_841530 (CHEMBL2091836)
IC50 135±n/a nM
Citation Kim, MHTsuhako, ALCo, EWAftab, DTBentzien, FChen, JCheng, WEngst, SGoon, LKlein, RRLe, DTMac, MParks, JJQian, FRodriquez, MStout, TJTill, JHWon, KAWu, XYakes, FMYu, PZhang, WZhao, YLamb, PNuss, JMXu, W The design, synthesis, and biological evaluation of potent receptor tyrosine kinase inhibitors. Bioorg Med Chem Lett22:4979-85 (2012) 
 
Vascular endothelial growth factor receptor 2
Name:Vascular endothelial growth factor receptor 2
Type:Receptor Tyrosine Kinase
Mol. Mass.:151510.97
Organism:Homo sapiens (Human)
Description:P35968
Residue:1356
BDBM4811
NameBDBM4811
Synonyms:(Z)-3-[2,4-dimethyl-5-(2-oxo-1,2-dihydro-indol-3-ylidenemethyl)-1H-pyrrol-3-yl]-propionic acid CHEMBL274654 | SU6668
TypeSmall organic molecule
Emp. Form.C18H18N2O3
Mol. Mass.310.3471
SMILESCc1[nH]c(\C=C2/C(=O)Nc3ccccc23)c(C)c1CCC(O)=O