Reaction Details
TargetVascular endothelial growth factor receptor 2
LigandBDBM50420996
Substrate/Competitorn/a
Meas. Tech.ChEMBL_841530 (CHEMBL2091836)
IC50 4±n/a nM
Citation Kim, MHTsuhako, ALCo, EWAftab, DTBentzien, FChen, JCheng, WEngst, SGoon, LKlein, RRLe, DTMac, MParks, JJQian, FRodriquez, MStout, TJTill, JHWon, KAWu, XYakes, FMYu, PZhang, WZhao, YLamb, PNuss, JMXu, W The design, synthesis, and biological evaluation of potent receptor tyrosine kinase inhibitors. Bioorg Med Chem Lett22:4979-85 (2012) 
 
Vascular endothelial growth factor receptor 2
Name:Vascular endothelial growth factor receptor 2
Type:Receptor Tyrosine Kinase
Mol. Mass.:151510.97
Organism:Homo sapiens (Human)
Description:P35968
Residue:1356
BDBM50420996
NameBDBM50420996
Synonyms:CHEMBL2086760
TypeSmall organic molecule
Emp. Form.C25H26ClN5O
Mol. Mass.447.96
SMILESCCN1CCC(CC1)Nc1ccc2NC(=O)C(=C(c3ncc[nH]3)c3ccc(Cl)cc3)c2c1