Reaction Details
TargetFibroblast growth factor receptor 1
LigandBDBM50420997
Substrate/Competitorn/a
Meas. Tech.ChEMBL_841301 (CHEMBL2090042)
IC50 11±n/a nM
Citation Kim, MHTsuhako, ALCo, EWAftab, DTBentzien, FChen, JCheng, WEngst, SGoon, LKlein, RRLe, DTMac, MParks, JJQian, FRodriquez, MStout, TJTill, JHWon, KAWu, XYakes, FMYu, PZhang, WZhao, YLamb, PNuss, JMXu, W The design, synthesis, and biological evaluation of potent receptor tyrosine kinase inhibitors. Bioorg Med Chem Lett22:4979-85 (2012) 
 
Fibroblast growth factor receptor 1
Name:Fibroblast growth factor receptor 1
Type:Receptor
Mol. Mass.:91861.70
Organism:Homo sapiens (Human)
Description:P11362
Residue:822
BDBM50420997
NameBDBM50420997
Synonyms:CHEMBL2086751
TypeSmall organic molecule
Emp. Form.C30H31N5O2
Mol. Mass.493.5994
SMILESCCN1CCC(CC1)Nc1ccc2NC(=O)C(=C(c3nc4ccc(OC)cc4[nH]3)c3ccccc3)c2c1