Reaction Details
TargetFibroblast growth factor receptor 1
LigandBDBM50421029
Substrate/Competitorn/a
Meas. Tech.ChEMBL_841301 (CHEMBL2090042)
IC50 8±n/a nM
Citation Kim, MHTsuhako, ALCo, EWAftab, DTBentzien, FChen, JCheng, WEngst, SGoon, LKlein, RRLe, DTMac, MParks, JJQian, FRodriquez, MStout, TJTill, JHWon, KAWu, XYakes, FMYu, PZhang, WZhao, YLamb, PNuss, JMXu, W The design, synthesis, and biological evaluation of potent receptor tyrosine kinase inhibitors. Bioorg Med Chem Lett22:4979-85 (2012) 
 
Fibroblast growth factor receptor 1
Name:Fibroblast growth factor receptor 1
Type:Receptor
Mol. Mass.:91861.70
Organism:Homo sapiens (Human)
Description:P11362
Residue:822
BDBM50421029
NameBDBM50421029
Synonyms:CHEMBL2086757
TypeSmall organic molecule
Emp. Form.C29H27F2N5O
Mol. Mass.499.5544
SMILESCCN1CCC(CC1)Nc1ccc2NC(=O)C(=C(c3nc4ccccc4[nH]3)c3cc(F)cc(F)c3)c2c1