Reaction Details
TargetVascular endothelial growth factor receptor 2
LigandBDBM50421032
Substrate/Competitorn/a
Meas. Tech.ChEMBL_841530 (CHEMBL2091836)
IC50 8±n/a nM
Citation Kim, MHTsuhako, ALCo, EWAftab, DTBentzien, FChen, JCheng, WEngst, SGoon, LKlein, RRLe, DTMac, MParks, JJQian, FRodriquez, MStout, TJTill, JHWon, KAWu, XYakes, FMYu, PZhang, WZhao, YLamb, PNuss, JMXu, W The design, synthesis, and biological evaluation of potent receptor tyrosine kinase inhibitors. Bioorg Med Chem Lett22:4979-85 (2012) 
 
Vascular endothelial growth factor receptor 2
Name:Vascular endothelial growth factor receptor 2
Type:Receptor Tyrosine Kinase
Mol. Mass.:151510.97
Organism:Homo sapiens (Human)
Description:P35968
Residue:1356
BDBM50421032
NameBDBM50421032
Synonyms:CHEMBL2086754
TypeSmall organic molecule
Emp. Form.C30H31N5O
Mol. Mass.477.6
SMILESCCN1CCC(CC1)Nc1ccc2NC(=O)C(=C(c3nc4ccccc4[nH]3)c3ccc(C)cc3)c2c1