Reaction Details
TargetPeroxisome proliferator-activated receptor gamma
LigandBDBM50002862
Substrate/Competitorn/a
Meas. Tech.ChEMBL_438960 (CHEMBL889304)
Ki 100±n/a nM
Citation Trump, RPCobb, JEShearer, BGLambert, MHNolte, RTWillson, TMBuckholz, RGZhao, SMLeesnitzer, LMIannone, MAPearce, KHBillin, ANHoekstra, WJ Co-crystal structure guided array synthesis of PPARgamma inverse agonists. Bioorg Med Chem Lett17:3916-20 (2007) 
 
Peroxisome proliferator-activated receptor gamma
Name:Peroxisome proliferator-activated receptor gamma
Type:Nuclear Receptor
Mol. Mass.:57613.46
Organism:Homo sapiens (Human)
Description:P37231
Residue:505
BDBM50002862
NameBDBM50002862
Synonyms:CHEMBL396220
TypeSmall organic molecule
Emp. Form.C44H42N4O6
Mol. Mass.722.8275
SMILESCc1oc(nc1CCOc1ccc(C[C@@H](CNC(=O)CNC(=O)c2cccc(CO)c2)Nc2ccccc2C(=O)c2ccccc2)cc1)-c1ccccc1