Reaction Details
TargetPeroxisome proliferator-activated receptor gamma
LigandBDBM50423010
Substrate/Competitorn/a
Meas. Tech.ChEMBL_438962 (CHEMBL889305)
IC50 1585±n/a nM
Citation Trump, RPCobb, JEShearer, BGLambert, MHNolte, RTWillson, TMBuckholz, RGZhao, SMLeesnitzer, LMIannone, MAPearce, KHBillin, ANHoekstra, WJ Co-crystal structure guided array synthesis of PPARgamma inverse agonists. Bioorg Med Chem Lett17:3916-20 (2007) 
 
Peroxisome proliferator-activated receptor gamma
Name:Peroxisome proliferator-activated receptor gamma
Type:Nuclear Receptor
Mol. Mass.:57613.46
Organism:Homo sapiens (Human)
Description:P37231
Residue:505
BDBM50423010
NameBDBM50423010
Synonyms:CHEMBL230259
TypeSmall organic molecule
Emp. Form.C36H35N3O4
Mol. Mass.573.6808
SMILESCC(=O)NC[C@H](Cc1ccc(OCCc2nc(oc2C)-c2ccccc2)cc1)Nc1ccccc1C(=O)c1ccccc1