Reaction Details
TargetPeroxisome proliferator-activated receptor gamma
LigandBDBM50423011
Substrate/Competitorn/a
Meas. Tech.ChEMBL_438962 (CHEMBL889305)
IC50 6310±n/a nM
Citation Trump, RPCobb, JEShearer, BGLambert, MHNolte, RTWillson, TMBuckholz, RGZhao, SMLeesnitzer, LMIannone, MAPearce, KHBillin, ANHoekstra, WJ Co-crystal structure guided array synthesis of PPARgamma inverse agonists. Bioorg Med Chem Lett17:3916-20 (2007) 
 
Peroxisome proliferator-activated receptor gamma
Name:Peroxisome proliferator-activated receptor gamma
Type:Nuclear Receptor
Mol. Mass.:57613.46
Organism:Homo sapiens (Human)
Description:P37231
Residue:505
BDBM50423011
NameBDBM50423011
Synonyms:CHEMBL267996
TypeSmall organic molecule
Emp. Form.C45H46N4O5
Mol. Mass.722.8705
SMILESCN(C)CCOc1cccc(c1)C(=O)NC[C@H](Cc1ccc(OCCc2nc(oc2C)-c2ccccc2)cc1)Nc1ccccc1C(=O)c1ccccc1