Reaction Details
TargetSolute carrier family 22 member 2
LigandBDBM50104435
Substrate/Competitorn/a
Meas. Tech.ChEMBL_934317 (CHEMBL2320303)
IC50 900±n/a nM
Citation Wittwer, MBZur, AAKhuri, NKido, YKosaka, AZhang, XMorrissey, KMSali, AHuang, YGiacomini, KM Discovery of potent, selective multidrug and toxin extrusion transporter 1 (MATE1, SLC47A1) inhibitors through prescription drug profiling and computational modeling. J Med Chem56:781-95 (2013) 
 
Solute carrier family 22 member 2
Name:Solute carrier family 22 member 2
Type:PROTEIN
Mol. Mass.:62591.01
Organism:Homo sapiens (Human)
Description:ChEMBL_1484077
Residue:555
BDBM50104435
NameBDBM50104435
Synonyms:4-(6-Guanidino-hexanoyloxy)-benzoic acid ethyl ester | CHEMBL87563
TypeSmall organic molecule
Emp. Form.C16H23N3O4
Mol. Mass.321.3715
SMILESCCOC(=O)c1ccc(OC(=O)CCCCCNC(N)=N)cc1