Reaction Details
TargetSphingosine 1-phosphate receptor 1
LigandBDBM50424952
Substrate/Competitorn/a
Meas. Tech.ChEMBL_934542 (CHEMBL2317283)
IC50 14±n/a nM
Citation Evindar, GDeng, HBernier, SGDoyle, ELorusso, JMorgan, BAWestlin, WF Exploring amino acids derivatives as potent, selective, and direct agonists of sphingosine-1-phosphate receptor subtype-1. Bioorg Med Chem Lett23:472-5 (2012) 
 
Sphingosine 1-phosphate receptor 1
Name:Sphingosine 1-phosphate receptor 1
Type:Enzyme
Mol. Mass.:42836.02
Organism:Homo sapiens (Human)
Description:P21453
Residue:382
BDBM50424952
NameBDBM50424952
Synonyms:CHEMBL2315814
TypeSmall organic molecule
Emp. Form.C18H28N2O4
Mol. Mass.336.4259
SMILESCCCCCCCCOc1ccc(NC(=O)[C@@H](N)CC(O)=O)cc1