Reaction Details
TargetSphingosine 1-phosphate receptor 3
LigandBDBM50424950
Substrate/Competitorn/a
Meas. Tech.ChEMBL_934543 (CHEMBL2317284)
IC50>10000±n/a nM
Citation Evindar, GDeng, HBernier, SGDoyle, ELorusso, JMorgan, BAWestlin, WF Exploring amino acids derivatives as potent, selective, and direct agonists of sphingosine-1-phosphate receptor subtype-1. Bioorg Med Chem Lett23:472-5 (2012) 
 
Sphingosine 1-phosphate receptor 3
Name:Sphingosine 1-phosphate receptor 3
Type:G Protein-Coupled Receptor (GPCR)
Mol. Mass.:42278.13
Organism:Homo sapiens (Human)
Description:Q99500
Residue:378
BDBM50424950
NameBDBM50424950
Synonyms:CHEMBL2315818
TypeSmall organic molecule
Emp. Form.C19H27F3N2O4
Mol. Mass.404.4239
SMILESCCCCCCCCOc1ccc(NC(=O)[C@@H](N)CC(O)=O)cc1C(F)(F)F