Reaction Details
TargetSphingosine 1-phosphate receptor 1
LigandBDBM50424953
Substrate/Competitorn/a
Meas. Tech.ChEMBL_934548 (CHEMBL2317289)
EC50 135±n/a nM
Citation Evindar, GDeng, HBernier, SGDoyle, ELorusso, JMorgan, BAWestlin, WF Exploring amino acids derivatives as potent, selective, and direct agonists of sphingosine-1-phosphate receptor subtype-1. Bioorg Med Chem Lett23:472-5 (2012) 
 
Sphingosine 1-phosphate receptor 1
Name:Sphingosine 1-phosphate receptor 1
Type:Enzyme
Mol. Mass.:42836.02
Organism:Homo sapiens (Human)
Description:P21453
Residue:382
BDBM50424953
NameBDBM50424953
Synonyms:CHEMBL2315819
TypeSmall organic molecule
Emp. Form.C20H29F3N2O4
Mol. Mass.418.4505
SMILESCCCCCCCCOc1ccc(NC(=O)[C@@](C)(N)CC(O)=O)cc1C(F)(F)F