Reaction Details
TargetKynurenine--oxoglutarate transaminase 3
LigandBDBM50426341
Substrate/Competitorn/a
Meas. Tech.ChEMBL_939752 (CHEMBL2329105)
IC50 1230±n/a nM
Citation Tuttle, JBAnderson, MBechle, BMCampbell, BMChang, CDounay, ABEvrard, EFonseca, KRGan, XGhosh, SHorner, WJames, LCKim, JYMcAllister, LAPandit, JParikh, VDRago, BJSalafia, MAStrick, CAZawadzke, LEVerhoest, PR Structure-Based Design of Irreversible Human KAT II Inhibitors: Discovery of New Potency-Enhancing Interactions. ACS Med Chem Lett4:37-40 (2013) 
 
Kynurenine--oxoglutarate transaminase 3
Name:Kynurenine--oxoglutarate transaminase 3
Type:PROTEIN
Mol. Mass.:51406.81
Organism:Homo sapiens (Human)
Description:ChEMBL_939752
Residue:454
BDBM50426341
NameBDBM50426341
Synonyms:CHEMBL2321944
TypeSmall organic molecule
Emp. Form.C15H14N2O3
Mol. Mass.270.2833
SMILESN[C@H]1Cc2cc(Oc3ccccc3)ccc2N(O)C1=O