Reaction Details
TargetSodium-dependent noradrenaline transporter
LigandBDBM50426350
Substrate/Competitorn/a
Meas. Tech.ChEMBL_939924 (CHEMBL2327306)
Ki 66±n/a nM
Citation Brown, DGBernstein, PRWu, YUrbanek, RABecker, CWThroner, SRDembofsky, BTSteelman, GBLazor, LAScott, CWWood, MWWesolowski, SSNugiel, DAKoch, SYu, JPivonka, DELi, SThompson, CZacco, AElmore, CSSchroeder, PLiu, JHurley, CAWard, SHunt, HJWilliams, KMcLaughlin, JHoesch, VSydserff, SMaier, DAharony, D Azepines and piperidines with dual norepinephrine dopamine uptake inhibition and antidepressant activity. ACS Med Chem Lett4:46-51 (2013) 
 
Sodium-dependent noradrenaline transporter
Name:Sodium-dependent noradrenaline transporter
Type:Multi-pass membrane protein
Mol. Mass.:69337.72
Organism:Homo sapiens (Human)
Description:P23975
Residue:617
BDBM50426350
NameBDBM50426350
Synonyms:CHEMBL2322000
TypeSmall organic molecule
Emp. Form.C12H13Cl2N
Mol. Mass.242.144
SMILESClc1ccc(cc1Cl)[C@H]1CNCC=CC1