Reaction Details
TargetCytochrome P450 2D6
LigandBDBM50426351
Substrate/Competitorn/a
Meas. Tech.ChEMBL_939926 (CHEMBL2327308)
IC50 3900±n/a nM
Citation Brown, DGBernstein, PRWu, YUrbanek, RABecker, CWThroner, SRDembofsky, BTSteelman, GBLazor, LAScott, CWWood, MWWesolowski, SSNugiel, DAKoch, SYu, JPivonka, DELi, SThompson, CZacco, AElmore, CSSchroeder, PLiu, JHurley, CAWard, SHunt, HJWilliams, KMcLaughlin, JHoesch, VSydserff, SMaier, DAharony, D Azepines and piperidines with dual norepinephrine dopamine uptake inhibition and antidepressant activity. ACS Med Chem Lett4:46-51 (2013) 
 
Cytochrome P450 2D6
Name:Cytochrome P450 2D6
Type:Protein
Mol. Mass.:55774.82
Organism:Homo sapiens (Human)
Description:P10635
Residue:497
BDBM50426351
NameBDBM50426351
Synonyms:CHEMBL2321999
TypeSmall organic molecule
Emp. Form.C12H13Cl2N
Mol. Mass.242.144
SMILESClc1ccc(cc1Cl)[C@@H]1CNCC=CC1