Reaction Details
TargetSodium channel protein type 3 subunit alpha
LigandBDBM50344821
Substrate/Competitorn/a
Meas. Tech.ChEMBL_938857 (CHEMBL2328126)
IC50<30±n/a nM
Citation Bagal, SKBrown, ADCox, PJOmoto, KOwen, RMPryde, DCSidders, BSkerratt, SEStevens, EBStorer, RISwain, NA Ion channels as therapeutic targets: a drug discovery perspective. J Med Chem56:593-624 (2013) 
 
Sodium channel protein type 3 subunit alpha
Name:Sodium channel protein type 3 subunit alpha
Type:Protein
Mol. Mass.:226276.42
Organism:Homo sapiens (Human)
Description:Q9NY46
Residue:2000
BDBM50344821
NameBDBM50344821
Synonyms:10-hydroxymethyl-5-imino-(2S)-12,13-dioxa-4,6-diazatetracyclo[7.3.1.13,11.03,8]tetradecane-1,2,7,10,14-pentaol CHEMBL507974 | tetrodotoxin
TypeSmall organic molecule
Emp. Form.C11H17N3O8
Mol. Mass.319.268
SMILESNC1=N[C@H](O)[C@H]2[C@H]3O[C@]4(O)O[C@@H]([C@@H](O)[C@@]2(N1)[C@@H]4O)[C@]3(O)CO