Reaction Details
TargetPotassium voltage-gated channel subfamily KQT member 2
LigandBDBM50426567
Substrate/Competitorn/a
Meas. Tech.ChEMBL_938653 (CHEMBL2327425)
EC50 2400±n/a nM
Citation Bagal, SKBrown, ADCox, PJOmoto, KOwen, RMPryde, DCSidders, BSkerratt, SEStevens, EBStorer, RISwain, NA Ion channels as therapeutic targets: a drug discovery perspective. J Med Chem56:593-624 (2013) 
 
Potassium voltage-gated channel subfamily KQT member 2
Name:Potassium voltage-gated channel subfamily KQT member 2
Type:PROTEIN
Mol. Mass.:95883.20
Organism:Homo sapiens (Human)
Description:ChEMBL_1457496
Residue:872
BDBM50426567
NameBDBM50426567
Synonyms:BMS-204352 MaxiPost
TypeSmall organic molecule
Emp. Form.C16H10ClF4NO2
Mol. Mass.359.703
SMILESCOc1ccc(Cl)cc1[C@]1(F)C(=O)Nc2cc(ccc12)C(F)(F)F