Reaction Details
TargetPotassium channel subfamily K member 2
LigandBDBM50017662
Substrate/Competitorn/a
Meas. Tech.ChEMBL_938659 (CHEMBL2327431)
IC50 180000±n/a nM
Citation Bagal, SKBrown, ADCox, PJOmoto, KOwen, RMPryde, DCSidders, BSkerratt, SEStevens, EBStorer, RISwain, NA Ion channels as therapeutic targets: a drug discovery perspective. J Med Chem56:593-624 (2013) 
 
Potassium channel subfamily K member 2
Name:Potassium channel subfamily K member 2
Type:Protein
Mol. Mass.:47099.16
Organism:Homo sapiens (Human)
Description:O95069
Residue:426
BDBM50017662
NameBDBM50017662
Synonyms:2-(Diethylamino)-2',6'-acetoxylidide CHEMBL79 LIDOCAINE N-(2,6-dimethylphenyl)-N(2),N(2)-diethylglycinamide SAMPL3, G5
TypeSmall organic molecule
Emp. Form.C14H22N2O
Mol. Mass.234.3373
SMILESCCN(CC)CC(=O)Nc1c(C)cccc1C