Reaction Details
TargetGlutamate receptor ionotropic, kainate 1
LigandBDBM50126761
Substrate/Competitorn/a
Meas. Tech.ChEMBL_938804 (CHEMBL2327948)
EC50 100±n/a nM
Citation Bagal, SKBrown, ADCox, PJOmoto, KOwen, RMPryde, DCSidders, BSkerratt, SEStevens, EBStorer, RISwain, NA Ion channels as therapeutic targets: a drug discovery perspective. J Med Chem56:593-624 (2013) 
 
Glutamate receptor ionotropic, kainate 1
Name:Glutamate receptor ionotropic, kainate 1
Type:Enzyme Catalytic Domain
Mol. Mass.:103984.96
Organism:Homo sapiens (Human)
Description:P39086
Residue:918
BDBM50126761
NameBDBM50126761
Synonyms:(S)-2-AMINO-3-(3-HYDROXY-5-TERT-BUTYLISOTHIAZOL-4-YL) PROPRIONIC ACID CHEMBL29024
TypeSmall organic molecule
Emp. Form.C10H16N2O3S
Mol. Mass.244.311
SMILESCC(C)(C)c1s[nH]c(=O)c1C[C@H](N)C(O)=O