Reaction Details
TargetGamma-aminobutyric acid receptor subunit alpha-3
LigandBDBM50142570
Substrate/Competitorn/a
Meas. Tech.ChEMBL_938812 (CHEMBL2327956)
Ki 0.50±n/a nM
Citation Bagal, SKBrown, ADCox, PJOmoto, KOwen, RMPryde, DCSidders, BSkerratt, SEStevens, EBStorer, RISwain, NA Ion channels as therapeutic targets: a drug discovery perspective. J Med Chem56:593-624 (2013) 
 
Gamma-aminobutyric acid receptor subunit alpha-3
Name:Gamma-aminobutyric acid receptor subunit alpha-3
Type:Enzyme Catalytic Domain
Mol. Mass.:55175.47
Organism:Homo sapiens (Human)
Description:GABA A Alpha3Beta1Gamma2 0 HUMAN::P34903
Residue:492
BDBM50142570
NameBDBM50142570
Synonyms:9-(4-Methyl-thiazol-2-yl)-11-pyridin-4-yl-6,7-dihydro-5H-2,7a-diaza-dibenzo[a,c]cyclohepten-8-one | CHEMBL45198
TypeSmall organic molecule
Emp. Form.C22H18N4OS
Mol. Mass.386.47
SMILESCc1csc(n1)-c1cc(-c2ccncc2)c2-c3cnccc3CCCn2c1=O