Reaction Details
TargetGamma-aminobutyric acid receptor subunit alpha-2
LigandBDBM50142570
Substrate/Competitorn/a
Meas. Tech.ChEMBL_938811 (CHEMBL2327955)
Ki 0.60±n/a nM
Citation Bagal, SKBrown, ADCox, PJOmoto, KOwen, RMPryde, DCSidders, BSkerratt, SEStevens, EBStorer, RISwain, NA Ion channels as therapeutic targets: a drug discovery perspective. J Med Chem56:593-624 (2013) 
 
Gamma-aminobutyric acid receptor subunit alpha-2
Name:Gamma-aminobutyric acid receptor subunit alpha-2
Type:Protein
Mol. Mass.:51338.78
Organism:Homo sapiens (Human)
Description:P47869
Residue:451
BDBM50142570
NameBDBM50142570
Synonyms:9-(4-Methyl-thiazol-2-yl)-11-pyridin-4-yl-6,7-dihydro-5H-2,7a-diaza-dibenzo[a,c]cyclohepten-8-one | CHEMBL45198
TypeSmall organic molecule
Emp. Form.C22H18N4OS
Mol. Mass.386.47
SMILESCc1csc(n1)-c1cc(-c2ccncc2)c2-c3cnccc3CCCn2c1=O