Reaction Details
TargetTransient receptor potential cation channel subfamily A member 1
LigandBDBM50318463
Substrate/Competitorn/a
Meas. Tech.ChEMBL_938822 (CHEMBL2328091)
IC50 6200±n/a nM
Citation Bagal, SKBrown, ADCox, PJOmoto, KOwen, RMPryde, DCSidders, BSkerratt, SEStevens, EBStorer, RISwain, NA Ion channels as therapeutic targets: a drug discovery perspective. J Med Chem56:593-624 (2013) 
 
Transient receptor potential cation channel subfamily A member 1
Name:Transient receptor potential cation channel subfamily A member 1
Type:Protein
Mol. Mass.:127514.20
Organism:Homo sapiens (Human)
Description:O75762
Residue:1119
BDBM50318463
NameBDBM50318463
Synonyms:2-(1,3-dimethyl-2,6-dioxo-2,3-dihydro-1H-purin-7(6H)-yl)-N-(4-isopropylphenyl)acetamide | CHEMBL1086310
TypeSmall organic molecule
Emp. Form.C18H21N5O3
Mol. Mass.355.391
SMILESCC(C)c1ccc(NC(=O)Cn2cnc3n(C)c(=O)n(C)c(=O)c23)cc1