Reaction Details
TargetCalcium-activated potassium channel subunit alpha-1
LigandBDBM50426567
Substrate/Competitorn/a
Meas. Tech.ChEMBL_938830 (CHEMBL2328099)
EC50 352±n/a nM
Citation Bagal, SKBrown, ADCox, PJOmoto, KOwen, RMPryde, DCSidders, BSkerratt, SEStevens, EBStorer, RISwain, NA Ion channels as therapeutic targets: a drug discovery perspective. J Med Chem56:593-624 (2013) 
 
Calcium-activated potassium channel subunit alpha-1
Name:Calcium-activated potassium channel subunit alpha-1
Type:PROTEIN
Mol. Mass.:137567.62
Organism:Homo sapiens (Human)
Description:ChEMBL_938830
Residue:1236
BDBM50426567
NameBDBM50426567
Synonyms:BMS-204352 MaxiPost
TypeSmall organic molecule
Emp. Form.C16H10ClF4NO2
Mol. Mass.359.703
SMILESCOc1ccc(Cl)cc1[C@]1(F)C(=O)Nc2cc(ccc12)C(F)(F)F