Reaction Details
TargetSodium channel protein type 10 subunit alpha
LigandBDBM50330932
Substrate/Competitorn/a
Meas. Tech.ChEMBL_938852 (CHEMBL2328121)
IC50 30±n/a nM
Citation Bagal, SKBrown, ADCox, PJOmoto, KOwen, RMPryde, DCSidders, BSkerratt, SEStevens, EBStorer, RISwain, NA Ion channels as therapeutic targets: a drug discovery perspective. J Med Chem56:593-624 (2013) 
 
Sodium channel protein type 10 subunit alpha
Name:Sodium channel protein type 10 subunit alpha
Type:Enzyme
Mol. Mass.:220609.21
Organism:Homo sapiens (Human)
Description:Q9Y5Y9
Residue:1956
BDBM50330932
NameBDBM50330932
Synonyms:CHEMBL1276882 | N-((2-Morpholin-4-yl-pyridin-3-yl)methyl)-6-(4-cyanophenyl)-pyrazine-2-carboxamide
TypeSmall organic molecule
Emp. Form.C22H20F3N5O3
Mol. Mass.459.4211
SMILESFC(F)(F)Oc1ccc(cc1)-c1cncc(n1)C(=O)NCc1cccnc1N1CCOCC1