Reaction Details
TargetSodium channel protein type 5 subunit alpha
LigandBDBM50390072
Substrate/Competitorn/a
Meas. Tech.ChEMBL_938843 (CHEMBL2328112)
IC50 13000±n/a nM
Citation Bagal, SKBrown, ADCox, PJOmoto, KOwen, RMPryde, DCSidders, BSkerratt, SEStevens, EBStorer, RISwain, NA Ion channels as therapeutic targets: a drug discovery perspective. J Med Chem56:593-624 (2013) 
 
Sodium channel protein type 5 subunit alpha
Name:Sodium channel protein type 5 subunit alpha
Type:Enzyme
Mol. Mass.:226908.60
Organism:Homo sapiens (Human)
Description:Q14524
Residue:2016
BDBM50390072
NameBDBM50390072
Synonyms:CHEMBL2069427
TypeSmall organic molecule
Emp. Form.C23H21F3N4O4
Mol. Mass.474.4324
SMILESCOc1cnc(cn1)-c1cccc2OC[C@H](Cc12)NC(=O)c1ccc(COCC(F)(F)F)nc1