Reaction Details
TargetFatty-acid amide hydrolase 1 [30-579]
LigandBDBM50426641
Substrate/Competitorn/a
Meas. Tech.ChEMBL_939361 (CHEMBL2327496)
IC50 6.1±n/a nM
Citation Kono, MMatsumoto, TKawamura, TNishimura, AKiyota, YOki, HMiyazaki, JIgaki, SBehnke, CAShimojo, MKori, M Synthesis, SAR study, and biological evaluation of a series of piperazine ureas as fatty acid amide hydrolase (FAAH) inhibitors. Bioorg Med Chem21:28-41 (2012) 
 
Fatty-acid amide hydrolase 1 [30-579]
Name:Fatty-acid amide hydrolase 1 [30-579]
Type:Single-pass membrane protein; homodimer
Mol. Mass.:60474.00
Organism:Rattus norvegicus (rat)
Description:P97612 (aa 30-579)
Residue:550
BDBM50426641
NameBDBM50426641
Synonyms:CHEMBL2326181
TypeSmall organic molecule
Emp. Form.C21H19N5O2S
Mol. Mass.405.473
SMILESO=C(Nc1noc2ccccc12)N1CCN(CC1)c1nc(cs1)-c1ccccc1