Reaction Details
TargetFatty-acid amide hydrolase 1 [30-579]
LigandBDBM50426650
Substrate/Competitorn/a
Meas. Tech.ChEMBL_939361 (CHEMBL2327496)
IC50 0.710000±n/a nM
Citation Kono, MMatsumoto, TKawamura, TNishimura, AKiyota, YOki, HMiyazaki, JIgaki, SBehnke, CAShimojo, MKori, M Synthesis, SAR study, and biological evaluation of a series of piperazine ureas as fatty acid amide hydrolase (FAAH) inhibitors. Bioorg Med Chem21:28-41 (2012) 
 
Fatty-acid amide hydrolase 1 [30-579]
Name:Fatty-acid amide hydrolase 1 [30-579]
Type:Single-pass membrane protein; homodimer
Mol. Mass.:60474.00
Organism:Rattus norvegicus (rat)
Description:P97612 (aa 30-579)
Residue:550
BDBM50426650
NameBDBM50426650
Synonyms:CHEMBL2326177
TypeSmall organic molecule
Emp. Form.C19H20FN5O2S
Mol. Mass.401.458
SMILESCc1onc(NC(=O)N2CCN(CC2)c2nc(cs2)-c2ccc(F)cc2)c1C