Reaction Details
TargetActivated CDC42 kinase 1
LigandBDBM50245853
Substrate/Competitorn/a
Meas. Tech.ChEMBL_939163 (CHEMBL2329235)
IC50 20±n/a nM
Citation Jin, MWang, JKleinberg, AKadalbajoo, MSiu, KWCooke, ABittner, MAYao, YThelemann, AJi, QBhagwat, SMulvihill, KMRechka, JAPachter, JACrew, APEpstein, DMulvihill, MJ Discovery of potent, selective and orally bioavailable imidazo[1,5-a]pyrazine derived ACK1 inhibitors. Bioorg Med Chem Lett23:979-84 (2013) 
 
Activated CDC42 kinase 1
Name:Activated CDC42 kinase 1
Type:Protein
Mol. Mass.:114577.86
Organism:Homo sapiens (Human)
Description:Q07912
Residue:1038
BDBM50245853
NameBDBM50245853
Synonyms:CHEMBL502156 | N3-(2,6-dimethylphenyl)-N6-(3-fluoro-4-(2-(pyrrolidin-1-yl)ethoxy)phenyl)-1-(3-methoxy-3-methylbutyl)-1H-pyrazolo[3,4-d]pyrimidine-3,6-diamine
TypeSmall organic molecule
Emp. Form.C31H40FN7O2
Mol. Mass.561.6934
SMILESCOC(C)(C)CCn1nc(Nc2c(C)cccc2C)c2cnc(Nc3ccc(OCCN4CCCC4)c(F)c3)nc12