Reaction Details
TargetCytochrome P450 2C19
LigandBDBM98282
Substrate/Competitorn/a
Meas. Tech.ChEMBL_939151 (CHEMBL2329223)
IC50 16300±n/a nM
Citation Jin, MWang, JKleinberg, AKadalbajoo, MSiu, KWCooke, ABittner, MAYao, YThelemann, AJi, QBhagwat, SMulvihill, KMRechka, JAPachter, JACrew, APEpstein, DMulvihill, MJ Discovery of potent, selective and orally bioavailable imidazo[1,5-a]pyrazine derived ACK1 inhibitors. Bioorg Med Chem Lett23:979-84 (2013) 
 
Cytochrome P450 2C19
Name:Cytochrome P450 2C19
Type:Enzyme
Mol. Mass.:55935.47
Organism:Homo sapiens (Human)
Description:P33261
Residue:490
BDBM98282
NameBDBM98282
Synonyms:US8481733, 94
TypeSmall organic molecule
Emp. Form.C24H24N4O3
Mol. Mass.416.4724
SMILESCOc1cc(Oc2ccccc2)ccc1-c1nc([C@H]2C[C@@](C)(O)C2)n2ccnc(N)c12