Reaction Details
TargetActivated CDC42 kinase 1
LigandBDBM98282
Substrate/Competitorn/a
Meas. Tech.ChEMBL_939163 (CHEMBL2329235)
IC50 35±n/a nM
Citation Jin, MWang, JKleinberg, AKadalbajoo, MSiu, KWCooke, ABittner, MAYao, YThelemann, AJi, QBhagwat, SMulvihill, KMRechka, JAPachter, JACrew, APEpstein, DMulvihill, MJ Discovery of potent, selective and orally bioavailable imidazo[1,5-a]pyrazine derived ACK1 inhibitors. Bioorg Med Chem Lett23:979-84 (2013) 
 
Activated CDC42 kinase 1
Name:Activated CDC42 kinase 1
Type:Protein
Mol. Mass.:114577.86
Organism:Homo sapiens (Human)
Description:Q07912
Residue:1038
BDBM98282
NameBDBM98282
Synonyms:US8481733, 94
TypeSmall organic molecule
Emp. Form.C24H24N4O3
Mol. Mass.416.4724
SMILESCOc1cc(Oc2ccccc2)ccc1-c1nc([C@H]2C[C@@](C)(O)C2)n2ccnc(N)c12