Reaction Details
TargetSerine/threonine-protein kinase ATR
LigandBDBM50427326
Substrate/Competitorn/a
Meas. Tech.ChEMBL_940945 (CHEMBL2330635)
IC50 5±n/a nM
Citation Foote, KMBlades, KCronin, AFillery, SGuichard, SSHassall, LHickson, IJacq, XJewsbury, PJMcGuire, TMNissink, JWOdedra, RPage, KPerkins, PSuleman, ATam, KThommes, PBroadhurst, RWood, C Discovery of 4-{4-[(3R)-3-Methylmorpholin-4-yl]-6-[1-(methylsulfonyl)cyclopropyl]pyrimidin-2-yl}-1H-indole (AZ20): a potent and selective inhibitor of ATR protein kinase with monotherapy in vivo antitumor activity. J Med Chem56:2125-38 (2013) 
 
Serine/threonine-protein kinase ATR
Name:Serine/threonine-protein kinase ATR
Type:Protein
Mol. Mass.:301404.58
Organism:Homo sapiens (Human)
Description:Q13535
Residue:2644
BDBM50427326
NameBDBM50427326
Synonyms:CHEMBL2325697
TypeSmall organic molecule
Emp. Form.C21H24N4O3S
Mol. Mass.412.505
SMILESC[C@@H]1COCCN1c1cc(nc(n1)-c1cccc2[nH]ccc12)C1(CC1)S(C)(=O)=O