Reaction Details
TargetTyrosine-protein kinase ABL2
LigandBDBM50427741
Substrate/Competitorn/a
Meas. Tech.ChEMBL_941935 (CHEMBL2330092)
IC50 18±n/a nM
Citation Desai, BDixon, KFarrant, EFeng, QGibson, KRvan Hoorn, WPMills, JMorgan, TParry, DMRamjee, MKSelway, CNTarver, GJWhitlock, GWright, AG Rapid discovery of a novel series of Abl kinase inhibitors by application of an integrated microfluidic synthesis and screening platform. J Med Chem56:3033-47 (2013) 
 
Tyrosine-protein kinase ABL2
Name:Tyrosine-protein kinase ABL2
Type:PROTEIN
Mol. Mass.:128360.63
Organism:Homo sapiens (Human)
Description:ChEMBL_325082
Residue:1182
BDBM50427741
NameBDBM50427741
Synonyms:CHEMBL2324931
TypeSmall organic molecule
Emp. Form.C31H30F3N5O2
Mol. Mass.561.5974
SMILESCc1ccc(NC(=O)c2ccc(CN3CCN(CCO)CC3)c(c2)C(F)(F)F)cc1C#Cc1cnc2ccccn12