Reaction Details
TargetTyrosine-protein kinase ABL2
LigandBDBM50427743
Substrate/Competitorn/a
Meas. Tech.ChEMBL_941937 (CHEMBL2330094)
IC50 67±n/a nM
Citation Desai, BDixon, KFarrant, EFeng, QGibson, KRvan Hoorn, WPMills, JMorgan, TParry, DMRamjee, MKSelway, CNTarver, GJWhitlock, GWright, AG Rapid discovery of a novel series of Abl kinase inhibitors by application of an integrated microfluidic synthesis and screening platform. J Med Chem56:3033-47 (2013) 
 
Tyrosine-protein kinase ABL2
Name:Tyrosine-protein kinase ABL2
Type:PROTEIN
Mol. Mass.:128360.63
Organism:Homo sapiens (Human)
Description:ChEMBL_325082
Residue:1182
BDBM50427743
NameBDBM50427743
Synonyms:CHEMBL2324929
TypeSmall organic molecule
Emp. Form.C25H27F3N8O
Mol. Mass.512.5301
SMILESCN1CCN(Cc2ccc(NC(=O)Nc3cc(C#Cc4ccc(N)nc4)n(C)n3)cc2C(F)(F)F)CC1