Reaction Details
TargetTyrosine-protein kinase ABL1
LigandBDBM50427744
Substrate/Competitorn/a
Meas. Tech.ChEMBL_941936 (CHEMBL2330093)
IC50 31±n/a nM
Citation Desai, BDixon, KFarrant, EFeng, QGibson, KRvan Hoorn, WPMills, JMorgan, TParry, DMRamjee, MKSelway, CNTarver, GJWhitlock, GWright, AG Rapid discovery of a novel series of Abl kinase inhibitors by application of an integrated microfluidic synthesis and screening platform. J Med Chem56:3033-47 (2013) 
 
Tyrosine-protein kinase ABL1
Name:Tyrosine-protein kinase ABL1
Type:Enzyme
Mol. Mass.:122897.30
Organism:Homo sapiens (Human)
Description:P00519
Residue:1130
BDBM50427744
NameBDBM50427744
Synonyms:CHEMBL2324928
TypeSmall organic molecule
Emp. Form.C25H26F3N7O
Mol. Mass.497.5154
SMILESCN1CCN(Cc2ccc(NC(=O)Nc3cc(C#Cc4cccnc4)n(C)n3)cc2C(F)(F)F)CC1