Reaction Details
TargetHypoxanthine-guanine phosphoribosyltransferase
LigandBDBM50427808
Substrate/Competitorn/a
Meas. Tech.ChEMBL_940694 (CHEMBL2329985)
Ki 600±n/a nM
Citation Keough, DTŠpacek, PHocková, DTichý, TVrbková, SSlavetínská, LJaneba, ZNaesens, LEdstein, MDChavchich, MWang, THde Jersey, JGuddat, LW Acyclic nucleoside phosphonates containing a second phosphonate group are potent inhibitors of 6-oxopurine phosphoribosyltransferases and have antimalarial activity. J Med Chem56:2513-26 (2013) 
 
Hypoxanthine-guanine phosphoribosyltransferase
Name:Hypoxanthine-guanine phosphoribosyltransferase
Type:Protein
Mol. Mass.:24579.61
Organism:Homo sapiens (Human)
Description:P00492
Residue:218
BDBM50427808
NameBDBM50427808
Synonyms:CHEMBL2325754
TypeSmall organic molecule
Emp. Form.C12H21N5O9P2
Mol. Mass.441.2708
SMILESNc1nc2n(CC(COCCP(O)(O)=O)OCCP(O)(O)=O)cnc2c(=O)[nH]1